BDBM50382930 CHEMBL115097
SMILES CCCCCCOc1cc2c(cc1N(C)c1ncc(cn1)C(O)=O)C(C)(C)CCC2(C)C
InChI Key InChIKey=JJUUTJCZMGZJDZ-UHFFFAOYSA-N
Data  1 KI  2 Kd
  Tab Delimited (TSV)   2D SDfile   Computed 3D by Vconf -m prep SDfile
Find this compound or compounds like it in BindingDB:
Activity Spreadsheet -- Enzyme Inhibition Constant Data from BindingDB
Found 2 hits for monomerid = 50382930
TargetRetinoic acid receptor RXR-alpha(Homo sapiens (Human))
Okayama University Graduate School Of Medicine
Curated by ChEMBL
LigandPNGBDBM50382930(CHEMBL115097)
Affinity DataKd:  1.35E+3nM. Assay description: Binding affinity to human RXR-alpha by ITC analysis
In DepthDetails ArticlePubMed
TargetRetinoic acid receptor RXR-alpha(Homo sapiens (Human))
Okayama University Graduate School Of Medicine
Curated by ChEMBL
LigandPNGBDBM50382930(CHEMBL115097)
Affinity DataKd:  260nM. Assay description: Binding affinity to human RXR-alpha LBD incubated for 2 hrs by tryptophan fluorescence quenching assay
In DepthDetails ArticlePubMed