BDBM50383868 CHEMBL2031157
SMILES OC(=O)[C@H](Cc1ccc(cc1)C#CCCNc1ccccn1)NC(=O)c1c(Cl)cccc1Cl
InChI Key InChIKey=MHKXMNCZAAKYLC-NRFANRHFSA-N
Data  2 IC50
  Tab Delimited (TSV)   2D SDfile   Computed 3D by Vconf -m prep SDfile
Find this compound or compounds like it in BindingDB:
Activity Spreadsheet -- Enzyme Inhibition Constant Data from BindingDB
Found 2 hits for monomerid = 50383868
TargetIntegrin alpha-5/beta-1(Homo sapiens (Human))
Astrazeneca
Curated by ChEMBL
LigandPNGBDBM50383868(CHEMBL2031157)
Affinity DataIC50:  2.10E+3nM. Assay description: Antagonist activity at integrin alpha5beta1 in human K562 cells assessed as inhibition of cell adhesion
In DepthDetails ArticlePubMed
TargetIntegrin alpha-5/beta-1(Homo sapiens (Human))
Astrazeneca
Curated by ChEMBL
LigandPNGBDBM50383868(CHEMBL2031157)
Affinity DataIC50:  69nM. Assay description: Binding affinity to integrin alpha5beta1
In DepthDetails ArticlePubMed