BDBM50384815 CHEMBL2037496
SMILES CN(C)C(=O)[C@H](N1[C@H](CC(C)(C)C)C(=O)N[C@H](C2Cc3ccccc3C2)C1=O)c1ccc(C)nc1
InChI Key InChIKey=OTJFIQFXAYGGLX-WXFUMESZSA-N
Data  1 KI
  Tab Delimited (TSV)   2D SDfile   Computed 3D by Vconf -m prep SDfile
Find this compound or compounds like it in BindingDB:
Activity Spreadsheet -- Enzyme Inhibition Constant Data from BindingDB
Found 1 hit for monomerid = 50384815
TargetOxytocin receptor(Homo sapiens (Human))
Glaxosmithkline
Curated by ChEMBL
LigandPNGBDBM50384815(CHEMBL2037496)
Affinity DataKi:  0.0631nM. Assay description: Displacement of [3H]oxytocin from human oxytocin receptor
In DepthDetails ArticlePubMed