BDBM50388351 CHEMBL2057273
SMILES COc1cccc(C2OC(CC(O)=O)c3ccc(Cl)n3-c3ccc(Cl)cc23)c1OC
InChI Key InChIKey=MLWVPFDQSBAUMK-UHFFFAOYSA-N
Data  1 IC50
  Tab Delimited (TSV)   2D SDfile   Computed 3D by Vconf -m prep SDfile
Find this compound or compounds like it in BindingDB:
Activity Spreadsheet -- Enzyme Inhibition Constant Data from BindingDB
Found 1 hit for monomerid = 50388351
TargetSqualene synthase(Rattus norvegicus)
Daiichi Sankyo
Curated by ChEMBL
LigandPNGBDBM50388351(CHEMBL2057273)
Affinity DataIC50:  1.60nM. Assay description: Inhibition of squalene synthase in rat hepatic cells
In DepthDetails ArticlePubMed