BDBM50388356 CHEMBL2057277
SMILES OC(=O)CC1OC(c2cccc(Cl)c2Cl)c2cc(Cl)ccc2-n2cccc12
InChI Key InChIKey=KZNFCNOMKJYOAD-UHFFFAOYSA-N
Data  1 IC50
  Tab Delimited (TSV)   2D SDfile   Computed 3D by Vconf -m prep SDfile
Find this compound or compounds like it in BindingDB:
Activity Spreadsheet -- Enzyme Inhibition Constant Data from BindingDB
Found 1 hit for monomerid = 50388356
TargetSqualene synthase(Rattus norvegicus)
Daiichi Sankyo
Curated by ChEMBL
LigandPNGBDBM50388356(CHEMBL2057277)
Affinity DataIC50:  52nM. Assay description: Inhibition of squalene synthase in rat hepatic cells
In DepthDetails ArticlePubMed