BDBM50388454 CHEMBL2059422
SMILES CC(N1CCCCCC1)c1cnc2c(C)c(NC(=O)c3ccc(OCC4CC4)cc3)ccc2c1
InChI Key InChIKey=IFEFDWUIXYPIMI-UHFFFAOYSA-N
Data  3 IC50
  Tab Delimited (TSV)   2D SDfile   Computed 3D by Vconf -m prep SDfile
Find this compound or compounds like it in BindingDB:
Activity Spreadsheet -- Enzyme Inhibition Constant Data from BindingDB
Found 3 hits for monomerid = 50388454
TargetMelanin-concentrating hormone receptor 1(RAT)
Takeda Pharmaceutical
Curated by ChEMBL
LigandPNGBDBM50388454(CHEMBL2059422)
Affinity DataIC50:  5.60nM. Assay description: Displacement of [125I]MCH from rat MCHR1 expressed in CHO cells after 60 mins by liquid scintillation counting
In DepthDetails ArticlePubMed
TargetMelanin-concentrating hormone receptor 1(Homo sapiens (Human))
Takeda Pharmaceutical
Curated by ChEMBL
LigandPNGBDBM50388454(CHEMBL2059422)
Affinity DataIC50:  2nM. Assay description: Displacement of [125I]MCH from human MCHR1 expressed in CHO cells after 60 mins by liquid scintillation counting
In DepthDetails ArticlePubMed
TargetMelanin-concentrating hormone receptor 1(Homo sapiens (Human))
Takeda Pharmaceutical
Curated by ChEMBL
LigandPNGBDBM50388454(CHEMBL2059422)
Affinity DataIC50:  3.40nM. Assay description: Antagonist activity at human MCHR1 expressed in CHO cells assessed as inhibition of MCH-stimulated arachidonic acid release after 45 mins by liquid s...
In DepthDetails ArticlePubMed