BDBM50388456 CHEMBL2059424
SMILES CC(N1CC[C@H](O)C1)c1cnc2c(C)c(NC(=O)c3ccc(OCC4CC4)cc3)ccc2c1
InChI Key InChIKey=JSVWEGWBBVUOER-IMMUGOHXSA-N
Data  2 IC50
  Tab Delimited (TSV)   2D SDfile   Computed 3D by Vconf -m prep SDfile
Find this compound or compounds like it in BindingDB:
Activity Spreadsheet -- Enzyme Inhibition Constant Data from BindingDB
Found 2 hits for monomerid = 50388456
TargetMelanin-concentrating hormone receptor 1(Homo sapiens (Human))
Takeda Pharmaceutical
Curated by ChEMBL
LigandPNGBDBM50388456(CHEMBL2059424)
Affinity DataIC50:  5.5nM. Assay description: Displacement of [125I]MCH from human MCHR1 expressed in CHO cells after 60 mins by liquid scintillation counting
In DepthDetails ArticlePubMed
TargetMelanin-concentrating hormone receptor 1(RAT)
Takeda Pharmaceutical
Curated by ChEMBL
LigandPNGBDBM50388456(CHEMBL2059424)
Affinity DataIC50:  19nM. Assay description: Displacement of [125I]MCH from rat MCHR1 expressed in CHO cells after 60 mins by liquid scintillation counting
In DepthDetails ArticlePubMed