BDBM50388489 CHEMBL2057296
SMILES COC(=O)N[C@H]1CC[C@@]2(C)[C@@H](CC[C@H]3[C@@H]4CCC(=O)[C@@]4(C)CC[C@H]23)C1
InChI Key InChIKey=QUSJHWWZBZTSAD-GPYRIXEGSA-N
Data  2 IC50
  Tab Delimited (TSV)   2D SDfile   Computed 3D by Vconf -m prep SDfile
Find this compound or compounds like it in BindingDB:
Activity Spreadsheet -- Enzyme Inhibition Constant Data from BindingDB
Found 2 hits for monomerid = 50388489
TargetGlucose-6-phosphate 1-dehydrogenase(Homo sapiens (Human))
University Of Manchester
Curated by ChEMBL
LigandPNGBDBM50388489(CHEMBL2057296)
Affinity DataIC50:  1.50E+3nM. Assay description: Inhibition of human recombinant N-terminal His tagged G6PD expressed in Escherichia coli JM109 (DE3) cells assessed as production of NADPH after 30 m...
In DepthDetails ArticlePubMed
TargetGlucose-6-phosphate 1-dehydrogenase(Homo sapiens (Human))
University Of Manchester
Curated by ChEMBL
LigandPNGBDBM50388489(CHEMBL2057296)
Affinity DataIC50:  7.80E+3nM. Assay description: Inhibition of G6PD in HEK293T cells assessed as accumulation of 6-phosphogluconate after 5 hrs by LC-MS/MS analysis using 6-aminonicotinamide
In DepthDetails ArticlePubMed