BDBM50388506 CHEMBL2057309
SMILES CC(=O)[C@H]1CC[C@H]2[C@@H]3CC[C@H]4C[C@H](CC[C@]4(C)[C@H]3CC[C@]12C)NS(=O)(=O)c1ccccc1
InChI Key InChIKey=PKWFDBFRFFODRV-OTXLFJBLSA-N
Data  1 IC50
  Tab Delimited (TSV)   2D SDfile   Computed 3D by Vconf -m prep SDfile
Find this compound or compounds like it in BindingDB:
Activity Spreadsheet -- Enzyme Inhibition Constant Data from BindingDB
Found 1 hit for monomerid = 50388506
TargetGlucose-6-phosphate 1-dehydrogenase(Homo sapiens (Human))
University Of Manchester
Curated by ChEMBL
LigandPNGBDBM50388506(CHEMBL2057309)
Affinity DataIC50:  2.03E+4nM. Assay description: Inhibition of human recombinant N-terminal His tagged G6PD expressed in Escherichia coli JM109 (DE3) cells assessed as production of NADPH after 30 m...
In DepthDetails ArticlePubMed