BDBM50388528 CHEMBL2058272
SMILES [#6]-[#6]C([#8])([#6]-[#6])[#6]-[#6]-[#6@@H](-[#6])-[#6@H]1-[#6]-[#6]-[#6@H]2\[#6](-[#6]-[#6]-[#6][C@]12[#6])=[#6]\[#6]=[#6]-1\[#6]-[#6@@H](-[#8])-[#6](=[#6])-[#6@H](-[#8])-[#6]-1
InChI Key InChIKey=CCJKDZZJQKPBID-IHLVXOQFSA-N
Data  1 IC50
PDB links: 1 PDB ID matches this monomer.
  Tab Delimited (TSV)   2D SDfile   Computed 3D by Vconf -m prep SDfile
Find this compound or compounds like it in BindingDB:
Activity Spreadsheet -- Enzyme Inhibition Constant Data from BindingDB
Found 1 hit for monomerid = 50388528
TargetVitamin D3 receptor(Homo sapiens (Human))
Showa Pharmaceutical University
Curated by ChEMBL
LigandPNGBDBM50388528(CHEMBL2058272)
Affinity DataIC50:  0.0290nM. Assay description: Displacement of [3H]1alpha,25-dihydroxyvitamin D3 from human recombinant GST-tagged vitamin D3 receptor LBD expressed in Escherichia coli BL21 after ...
In DepthDetails ArticlePubMed