BDBM50390564 CHEMBL2069353
SMILES CC(=O)N1CCC(CC1)C(=O)Nc1cc(Nc2cnccn2)nc(c1)-c1ccnc(c1)N1CCNCC1
InChI Key InChIKey=HQEIASUFWZAWFB-UHFFFAOYSA-N
Data  1 IC50
  Tab Delimited (TSV)   2D SDfile   Computed 3D by Vconf -m prep SDfile
Find this compound or compounds like it in BindingDB:
Activity Spreadsheet -- Enzyme Inhibition Constant Data from BindingDB
Found 1 hit for monomerid = 50390564
TargetLysine--tRNA ligase(Homo sapiens (Human))
RhôNe-Poulenc Rorer
Curated by ChEMBL
LigandPNGBDBM50390564(CHEMBL2069353)
Affinity DataIC50:  5nM. Assay description: Inhibition of human recombinant full-length Syk using poly-GT as substrate after 40 mins by radioactive filtration assay
In DepthDetails ArticlePubMed