BDBM50390569 CHEMBL2069359
SMILES OC(=O)c1ccc(cc1)C(=O)Nc1cc(Nc2cnccn2)nc(c1)-c1ccnc(c1)N1CCNCC1
InChI Key InChIKey=RFJUUVMKBNKUPM-UHFFFAOYSA-N
Data  1 IC50
  Tab Delimited (TSV)   2D SDfile   Computed 3D by Vconf -m prep SDfile
Find this compound or compounds like it in BindingDB:
Activity Spreadsheet -- Enzyme Inhibition Constant Data from BindingDB
Found 1 hit for monomerid = 50390569
TargetLysine--tRNA ligase(Homo sapiens (Human))
RhôNe-Poulenc Rorer
Curated by ChEMBL
LigandPNGBDBM50390569(CHEMBL2069359)
Affinity DataIC50:  8nM. Assay description: Inhibition of human recombinant full-length Syk using poly-GT as substrate after 40 mins by radioactive filtration assay
In DepthDetails ArticlePubMed