BDBM50390587 CHEMBL2069492
SMILES Cc1ccc(C[C@H](N)C(=O)Nc2cc(c[nH]c2=O)-c2ccncc2)cc1
InChI Key InChIKey=NTZHGDLSLGWDGT-KRWDZBQOSA-N
Data  1 EC50
  Tab Delimited (TSV)   2D SDfile   Computed 3D by Vconf -m prep SDfile
Find this compound or compounds like it in BindingDB:
Activity Spreadsheet -- Enzyme Inhibition Constant Data from BindingDB
Found 1 hit for monomerid = 50390587
TargetProbable G-protein coupled receptor 142(Homo sapiens (Human))
Amgen
Curated by ChEMBL
LigandPNGBDBM50390587(CHEMBL2069492)
Affinity DataEC50:  6.60E+3nM. Assay description: Agonist activity at human GPR142 expressed in HEK293 cells assessed as inositol phosphate accumulation using [3H]-inositol after 1 hr by scintillatio...
In DepthDetails ArticlePubMed