BDBM50390590 CHEMBL2069495
SMILES CC(=O)N[C@@H](Cc1ccccc1)C(=O)Nc1cc(c[nH]c1=O)-c1ccncc1
InChI Key InChIKey=BEJKYTISJLMNJE-SFHVURJKSA-N
Data  1 EC50
  Tab Delimited (TSV)   2D SDfile   Computed 3D by Vconf -m prep SDfile
Find this compound or compounds like it in BindingDB:
Activity Spreadsheet -- Enzyme Inhibition Constant Data from BindingDB
Found 1 hit for monomerid = 50390590
TargetProbable G-protein coupled receptor 142(Homo sapiens (Human))
Amgen
Curated by ChEMBL
LigandPNGBDBM50390590(CHEMBL2069495)
Affinity DataEC50: >3.30E+4nM. Assay description: Agonist activity at human GPR142 expressed in HEK293 cells assessed as inositol phosphate accumulation using [3H]-inositol after 1 hr by scintillatio...
In DepthDetails ArticlePubMed