BDBM50390600 CHEMBL2069580
SMILES O=C(Nc1ccccc1)[C@H](Cc1ccccc1)NCc1cscn1
InChI Key InChIKey=YYIYZMYILJFGBX-SFHVURJKSA-N
Data  1 EC50
  Tab Delimited (TSV)   2D SDfile   Computed 3D by Vconf -m prep SDfile
Find this compound or compounds like it in BindingDB:
Activity Spreadsheet -- Enzyme Inhibition Constant Data from BindingDB
Found 1 hit for monomerid = 50390600
TargetProbable G-protein coupled receptor 142(Homo sapiens (Human))
Amgen
Curated by ChEMBL
LigandPNGBDBM50390600(CHEMBL2069580)
Affinity DataEC50:  3.30E+3nM. Assay description: Agonist activity at human GPR142 expressed in HEK293 cells assessed as inositol phosphate accumulation using [3H]-inositol after 1 hr by scintillatio...
In DepthDetails ArticlePubMed