BDBM50390736 CHEMBL2070359
SMILES CC(C)CN(c1ccc(cc1)C(O)(C#CC1=CCCCC1)C(F)(F)F)S(=O)(=O)c1ccccc1
InChI Key InChIKey=NNEYGSCCUBHPHI-UHFFFAOYSA-N
Data  2 IC50
  Tab Delimited (TSV)   2D SDfile   Computed 3D by Vconf -m prep SDfile
Find this compound or compounds like it in BindingDB:
Activity Spreadsheet -- Enzyme Inhibition Constant Data from BindingDB
Found 2 hits for monomerid = 50390736
TargetOxysterols receptor LXR-beta(Homo sapiens (Human))
Amgen
Curated by ChEMBL
LigandPNGBDBM50390736(CHEMBL2070359)
Affinity DataIC50:  1.10E+3nM. Assay description: Displacement of [3H]N-(4-(1,1,1,3,3,3-hexafluoro-2-hydroxypropan-2-yl)phenyl)-N-methylbenzenesulfonamide from GST-tagged LXRbeta ligand binding domai...
In DepthDetails ArticlePubMed
TargetOxysterols receptor LXR-beta(Homo sapiens (Human))
Amgen
Curated by ChEMBL
LigandPNGBDBM50390736(CHEMBL2070359)
Affinity DataIC50: >1.00E+4nM. Assay description: Antagonist activity at LXRbeta ligand binding domain expressed in HEK293 cells coexpressing GAL4 assessed as decrease in [3H]N-(4-(1,1,1,3,3,3-hexafl...
In DepthDetails ArticlePubMed