BDBM50390766 CHEMBL2070463
SMILES CC(C)(C)CN(c1ccc(cc1)C(O)(C#Cc1ccc(cc1)S(C)(=O)=O)C(F)(F)F)S(=O)(=O)c1ccccc1
InChI Key InChIKey=ZATNJKHDTLHDQN-UHFFFAOYSA-N
Data  2 IC50
  Tab Delimited (TSV)   2D SDfile   Computed 3D by Vconf -m prep SDfile
Find this compound or compounds like it in BindingDB:
Activity Spreadsheet -- Enzyme Inhibition Constant Data from BindingDB
Found 2 hits for monomerid = 50390766
TargetOxysterols receptor LXR-beta(Homo sapiens (Human))
Amgen
Curated by ChEMBL
LigandPNGBDBM50390766(CHEMBL2070463)
Affinity DataIC50:  6.00E+3nM. Assay description: Antagonist activity at LXRbeta ligand binding domain expressed in HEK293 cells coexpressing GAL4 assessed as decrease in [3H]N-(4-(1,1,1,3,3,3-hexafl...
In DepthDetails ArticlePubMed
TargetOxysterols receptor LXR-beta(Homo sapiens (Human))
Amgen
Curated by ChEMBL
LigandPNGBDBM50390766(CHEMBL2070463)
Affinity DataIC50:  1.20E+3nM. Assay description: Displacement of [3H]N-(4-(1,1,1,3,3,3-hexafluoro-2-hydroxypropan-2-yl)phenyl)-N-methylbenzenesulfonamide from GST-tagged LXRbeta ligand binding domai...
In DepthDetails ArticlePubMed