BDBM50390788 CHEMBL2070612
SMILES CCC(CC)Oc1cc(C)c(c(C)c1)-c1cc(nc(n1)-c1cnccn1)-c1cnc(NC(=O)C(C)C)s1
InChI Key InChIKey=WTRAMLNUHRBZEC-UHFFFAOYSA-N
Data  4 IC50
  Tab Delimited (TSV)   2D SDfile   Computed 3D by Vconf -m prep SDfile
Find this compound or compounds like it in BindingDB:
Activity Spreadsheet -- Enzyme Inhibition Constant Data from BindingDB
Found 4 hits for monomerid = 50390788
TargetLIM domain kinase 1(Homo sapiens (Human))
Bristol-Myers Squibb Research And Development
Curated by ChEMBL
LigandPNGBDBM50390788(CHEMBL2070612)
Affinity DataIC50:  172nM. Assay description: Inhibition of LIMK1
In DepthDetails ArticlePubMed
TargetDual specificity testis-specific protein kinase 2(Homo sapiens (Human))
Bristol-Myers Squibb Research And Development
Curated by ChEMBL
LigandPNGBDBM50390788(CHEMBL2070612)
Affinity DataIC50: >1.25E+4nM. Assay description: Inhibition of TESK2
In DepthDetails ArticlePubMed
TargetDual specificity testis-specific protein kinase 1(Homo sapiens (Human))
Bristol-Myers Squibb Research And Development
Curated by ChEMBL
LigandPNGBDBM50390788(CHEMBL2070612)
Affinity DataIC50: >1.25E+4nM. Assay description: Inhibition of TESK1
In DepthDetails ArticlePubMed
TargetLIM domain kinase 2(Homo sapiens (Human))
Bristol-Myers Squibb Research And Development
Curated by ChEMBL
LigandPNGBDBM50390788(CHEMBL2070612)
Affinity DataIC50:  245nM. Assay description: Inhibition of LIMK2
In DepthDetails ArticlePubMed