BDBM50392773 CHEMBL2151148
SMILES CCc1ccc2OC3(CCC3)C[C@H](NC[C@@H](O)[C@H](Cc3ccccc3)NC(=O)c3cc(-c4ccccn4)c(=O)n(c3)C3CCCC3)c2c1
InChI Key InChIKey=WRITUJLAWAHZDW-QGBCWPEESA-N
Data  2 IC50
  Tab Delimited (TSV)   2D SDfile   Computed 3D by Vconf -m prep SDfile
Find this compound or compounds like it in BindingDB:
Activity Spreadsheet -- Enzyme Inhibition Constant Data from BindingDB
Found 2 hits for monomerid = 50392773
TargetBeta-secretase 1(Homo sapiens (Human))
TBA
Curated by ChEMBL
LigandPNGBDBM50392773(CHEMBL2151148)
Affinity DataIC50:  8.80nM. Assay description: Inhibition of BACE by cells based assay
In DepthDetails ArticlePubMed
TargetBeta-secretase 1(Homo sapiens (Human))
TBA
Curated by ChEMBL
LigandPNGBDBM50392773(CHEMBL2151148)
Affinity DataIC50:  3.60nM. Assay description: Inhibition of BACE
In DepthDetails ArticlePubMed