BDBM50392778 CHEMBL2151153
SMILES CC(=O)N[C@@H](Cc1ccc(Cl)cc1)[C@H](O)CN[C@H]1CC2(CCC2)Oc2ncc(CC(C)(C)C)cc12
InChI Key InChIKey=DOUDLQBZEIQPDX-CCDWMCETSA-N
Data  2 IC50
  Tab Delimited (TSV)   2D SDfile   Computed 3D by Vconf -m prep SDfile
Find this compound or compounds like it in BindingDB:
Activity Spreadsheet -- Enzyme Inhibition Constant Data from BindingDB
Found 2 hits for monomerid = 50392778
TargetBeta-secretase 1(Homo sapiens (Human))
TBA
Curated by ChEMBL
LigandPNGBDBM50392778(CHEMBL2151153)
Affinity DataIC50:  8.30nM. Assay description: Inhibition of BACE
In DepthDetails ArticlePubMed
TargetBeta-secretase 1(Homo sapiens (Human))
TBA
Curated by ChEMBL
LigandPNGBDBM50392778(CHEMBL2151153)
Affinity DataIC50:  13nM. Assay description: Inhibition of BACE by cells based assay
In DepthDetails ArticlePubMed