BDBM50394622 CHEMBL2164604
SMILES Clc1ccc(Oc2cccc(CN3CCN(CC3)C(=O)Nc3ccncn3)c2)cc1
InChI Key InChIKey=LZZNJYXLLFWCMG-UHFFFAOYSA-N
Data  2 IC50
  Tab Delimited (TSV)   2D SDfile   Computed 3D by Vconf -m prep SDfile
Find this compound or compounds like it in BindingDB:
Activity Spreadsheet -- Enzyme Inhibition Constant Data from BindingDB
Found 2 hits for monomerid = 50394622
TargetFatty-acid amide hydrolase 1(Homo sapiens (Human))
TBA
Curated by ChEMBL
LigandPNGBDBM50394622(CHEMBL2164604)
Affinity DataIC50:  41nM. Assay description: Inhibition of human FAAH after 1 hr
In DepthDetails ArticlePubMed
TargetFatty-acid amide hydrolase 1 [30-579](Rattus norvegicus (rat))
TBA
Curated by ChEMBL
LigandPNGBDBM50394622(CHEMBL2164604)
Affinity DataIC50:  1.50E+3nM. Assay description: Inhibition of rat FAAH after 1 hr
In DepthDetails ArticlePubMed