BDBM50394628 CHEMBL2164597
SMILES Clc1ccc(Oc2ccc(CN3CCN(CC3)C(=O)Nc3ccccc3)cc2)cc1
InChI Key InChIKey=DPSKEDFYUIYHOI-UHFFFAOYSA-N
Data  2 IC50
  Tab Delimited (TSV)   2D SDfile   Computed 3D by Vconf -m prep SDfile
Find this compound or compounds like it in BindingDB:
Activity Spreadsheet -- Enzyme Inhibition Constant Data from BindingDB
Found 2 hits for monomerid = 50394628
TargetFatty-acid amide hydrolase 1(Homo sapiens (Human))
TBA
Curated by ChEMBL
LigandPNGBDBM50394628(CHEMBL2164597)
Affinity DataIC50:  62nM. Assay description: Inhibition of human FAAH after 1 hr
In DepthDetails ArticlePubMed
TargetFatty-acid amide hydrolase 1 [30-579](Rattus norvegicus (rat))
TBA
Curated by ChEMBL
LigandPNGBDBM50394628(CHEMBL2164597)
Affinity DataIC50:  4.00E+3nM. Assay description: Inhibition of rat FAAH after 1 hr
In DepthDetails ArticlePubMed