BDBM50394636 CHEMBL2164589
SMILES O=C(Nc1ccccc1)N1CCN(Cc2ccc(cc2)C#N)CC1
InChI Key InChIKey=BBRXYKZFVXVMBK-UHFFFAOYSA-N
Data  2 IC50
  Tab Delimited (TSV)   2D SDfile   Computed 3D by Vconf -m prep SDfile
Find this compound or compounds like it in BindingDB:
Activity Spreadsheet -- Enzyme Inhibition Constant Data from BindingDB
Found 2 hits for monomerid = 50394636
TargetFatty-acid amide hydrolase 1(Homo sapiens (Human))
TBA
Curated by ChEMBL
LigandPNGBDBM50394636(CHEMBL2164589)
Affinity DataIC50:  4.67E+3nM. Assay description: Inhibition of human FAAH after 1 hr
In DepthDetails ArticlePubMed
TargetFatty-acid amide hydrolase 1 [30-579](Rattus norvegicus (rat))
TBA
Curated by ChEMBL
LigandPNGBDBM50394636(CHEMBL2164589)
Affinity DataIC50:  7.67E+3nM. Assay description: Inhibition of rat FAAH after 1 hr
In DepthDetails ArticlePubMed