BDBM50396961 CHEMBL2170963
SMILES Fc1ccc(cc1)-c1cnc2nnc(COc3cccnc3)n2n1
InChI Key InChIKey=UDPWSNFKUBMCKI-UHFFFAOYSA-N
Data  1 KI
  Tab Delimited (TSV)   2D SDfile   Computed 3D by Vconf -m prep SDfile
Find this compound or compounds like it in BindingDB:
Activity Spreadsheet -- Enzyme Inhibition Constant Data from BindingDB
Found 1 hit for monomerid = 50396961
TargetHepatocyte growth factor receptor(Homo sapiens (Human))
Pfizer
Curated by ChEMBL
LigandPNGBDBM50396961(CHEMBL2170963)
Affinity DataKi:  7.39E+3nM. Assay description: Competitive inhibition of N-terminal His6-tagged recombinant human c-MET (974 to 1390 amino acids) by spectrophotometry
In DepthDetails ArticlePubMed