BDBM50397753 CHEMBL2177177
SMILES CN1CCN(CC1)S(=O)(=O)c1ccc(cc1)-c1cnc(N)c(n1)C(=O)Nc1ncns1
InChI Key InChIKey=KZIAOAADZPTJQN-UHFFFAOYSA-N
Data  1 KI
  Tab Delimited (TSV)   2D SDfile   Computed 3D by Vconf -m prep SDfile
Find this compound or compounds like it in BindingDB:
Activity Spreadsheet -- Enzyme Inhibition Constant Data from BindingDB
Found 1 hit for monomerid = 50397753
TargetGlycogen synthase kinase-3 beta(Homo sapiens (Human))
Astrazeneca
Curated by ChEMBL
LigandPNGBDBM50397753(CHEMBL2177177)
Affinity DataKi:  0.990nM. Assay description: Inhibition of human recombinant GSK3beta using biotin- AAEELDSRAGS(PO3H2)PQL as substrate and [gamma32P]ATP after 20 mins by scintillation proximity ...
In DepthDetails ArticlePubMed