BDBM50398273 CHEMBL2177915
SMILES CC#Cc1cncc(c1)-c1cccc(c1)C1(N=C(N)c2c1cccc2F)c1ccnc(c1)C(F)F
InChI Key InChIKey=JHBVXZXFCJIAJZ-UHFFFAOYSA-N
Data  3 IC50
  Tab Delimited (TSV)   2D SDfile   Computed 3D by Vconf -m prep SDfile
Find this compound or compounds like it in BindingDB:
Activity Spreadsheet -- Enzyme Inhibition Constant Data from BindingDB
Found 3 hits for monomerid = 50398273
TargetBeta-secretase 1(Homo sapiens (Human))
Astrazeneca
Curated by ChEMBL
LigandPNGBDBM50398273(CHEMBL2177915)
Affinity DataIC50:  6.5nM. Assay description: Inhibition of human recombinant BACE1 using (europium)CEVNLDAEFK(Qsy7) as substrate incubated for 10 mins prior to substrate addition measured after ...
In DepthDetails ArticlePubMed
TargetPotassium voltage-gated channel subfamily H member 2(Homo sapiens (Human))
Astrazeneca
Curated by ChEMBL
LigandPNGBDBM50398273(CHEMBL2177915)
Affinity DataIC50:  2.90E+3nM. Assay description: Inhibition of human ERG expressed in CHO cells by IonWorks assay
In DepthDetails ArticlePubMed
TargetBeta-secretase 1(Homo sapiens (Human))
Astrazeneca
Curated by ChEMBL
LigandPNGBDBM50398273(CHEMBL2177915)
Affinity DataIC50:  3nM. Assay description: Inhibition of BACE1 in human SH-SY5Y cells assessed as inhibition of sAPPbeta release after 16 hrs by immunoassay
In DepthDetails ArticlePubMed