BDBM50398281 CHEMBL2177308
SMILES NC1=NC(c2ccccc12)(c1cccc(c1)-c1cncnc1)c1ccnc(c1)C(F)(F)F
InChI Key InChIKey=JLXRYBDDOAPKHW-UHFFFAOYSA-N
Data  3 IC50
  Tab Delimited (TSV)   2D SDfile   Computed 3D by Vconf -m prep SDfile
Find this compound or compounds like it in BindingDB:
Activity Spreadsheet -- Enzyme Inhibition Constant Data from BindingDB
Found 3 hits for monomerid = 50398281
TargetBeta-secretase 1(Homo sapiens (Human))
Astrazeneca
Curated by ChEMBL
LigandPNGBDBM50398281(CHEMBL2177308)
Affinity DataIC50:  2.10nM. Assay description: Inhibition of BACE1 in human SH-SY5Y cells assessed as inhibition of sAPPbeta release after 16 hrs by immunoassay
In DepthDetails ArticlePubMed
TargetPotassium voltage-gated channel subfamily H member 2(Homo sapiens (Human))
Astrazeneca
Curated by ChEMBL
LigandPNGBDBM50398281(CHEMBL2177308)
Affinity DataIC50:  5.50E+3nM. Assay description: Inhibition of human ERG expressed in CHO cells by IonWorks assay
In DepthDetails ArticlePubMed
TargetBeta-secretase 1(Homo sapiens (Human))
Astrazeneca
Curated by ChEMBL
LigandPNGBDBM50398281(CHEMBL2177308)
Affinity DataIC50:  134nM. Assay description: Inhibition of human recombinant BACE1 using (europium)CEVNLDAEFK(Qsy7) as substrate incubated for 10 mins prior to substrate addition measured after ...
In DepthDetails ArticlePubMed