BDBM50399618 CHEMBL2181185
SMILES CCCN1CCC(COc2nc3cc(F)ccc3c3ccccc23)CC1
InChI Key InChIKey=DBUWXKOGBDPUGP-UHFFFAOYSA-N
Data  2 KI
  Tab Delimited (TSV)   2D SDfile   Computed 3D by Vconf -m prep SDfile
Find this compound or compounds like it in BindingDB:
Activity Spreadsheet -- Enzyme Inhibition Constant Data from BindingDB
Found 2 hits for monomerid = 50399618
Target5-hydroxytryptamine receptor 4(Homo sapiens (Human))
Universit£
Curated by ChEMBL
LigandPNGBDBM50399618(CHEMBL2181185)
Affinity DataKi:  33nM. Assay description: Displacement of [3H]GR113808 from human recombinant 5HT4R expressed in HEK293T cells
In DepthDetails ArticlePubMed
Target5-hydroxytryptamine receptor 4(GUINEA PIG)
Universit£
Curated by ChEMBL
LigandPNGBDBM50399618(CHEMBL2181185)
Affinity DataKi:  101nM. Assay description: Displacement of [3H]GR113808 from 5HT4R in guinea pig striatal membranes
In DepthDetails ArticlePubMed