BDBM50399633 CHEMBL2181190
SMILES CCCN1CCC(COc2nc3ccccc3c3cccc(F)c23)CC1
InChI Key InChIKey=ADONYAJEPBCRAQ-UHFFFAOYSA-N
Data  1 KI
  Tab Delimited (TSV)   2D SDfile   Computed 3D by Vconf -m prep SDfile
Find this compound or compounds like it in BindingDB:
Activity Spreadsheet -- Enzyme Inhibition Constant Data from BindingDB
Found 1 hit for monomerid = 50399633
Target5-hydroxytryptamine receptor 4(GUINEA PIG)
Universit£
Curated by ChEMBL
LigandPNGBDBM50399633(CHEMBL2181190)
Affinity DataKi:  21.6nM. Assay description: Displacement of [3H]GR113808 from 5HT4R in guinea pig striatal membranes
In DepthDetails ArticlePubMed