BDBM50399944 CHEMBL2181244
SMILES COc1ccccc1N(C)C(=O)c1cncnc1Oc1cc(Cl)ccc1Cl
InChI Key InChIKey=DWBDWTLBGPVCTD-UHFFFAOYSA-N
Data  1 EC50
  Tab Delimited (TSV)   2D SDfile   Computed 3D by Vconf -m prep SDfile
Find this compound or compounds like it in BindingDB:
Activity Spreadsheet -- Enzyme Inhibition Constant Data from BindingDB
Found 1 hit for monomerid = 50399944
TargetG-protein coupled bile acid receptor 1(Homo sapiens (Human))
Chinese Academy Of Sciences
Curated by ChEMBL
LigandPNGBDBM50399944(CHEMBL2181244)
Affinity DataEC50:  160nM. Assay description: Agonist activity at human TGR5 expressed in HEK293 cells incubated for 5.5 hrs by CRE-driven luciferase reporter gene assay
In DepthDetails ArticlePubMed