BDBM50400791 CHEMBL2203619
SMILES Cc1nc2ccccc2n1C1(C)CCN(CC[C@H](NC(=O)C2CCC2)c2ccccc2)CC1
InChI Key InChIKey=LKGIWTVSYFHATA-DEOSSOPVSA-N
Data  1 IC50
  Tab Delimited (TSV)   2D SDfile   Computed 3D by Vconf -m prep SDfile
Find this compound or compounds like it in BindingDB:
Activity Spreadsheet -- Enzyme Inhibition Constant Data from BindingDB
Found 1 hit for monomerid = 50400791
TargetC-C chemokine receptor type 5(Homo sapiens (Human))
TBA
Curated by ChEMBL
LigandPNGBDBM50400791(CHEMBL2203619)
Affinity DataIC50:  1.20nM. Assay description: Displacement of [125I]MIP-1beta from CCR5 receptor
In DepthDetails ArticlePubMed