BDBM50400915 CHEMBL2205057
SMILES CC1(C)[C@@H]2C[C@H]1C(C[N+](C)(C)Cc1ccc(cc1)-c1ccoc1)=CC2
InChI Key InChIKey=RHULBIJEULGXPV-VXKWHMMOSA-N
Data  1 KI
  Tab Delimited (TSV)   2D SDfile   Computed 3D by Vconf -m prep SDfile
Find this compound or compounds like it in BindingDB:
Activity Spreadsheet -- Enzyme Inhibition Constant Data from BindingDB
Found 1 hit for monomerid = 50400915
TargetC-X-C chemokine receptor type 3(Homo sapiens (Human))
Vu University Amsterdam
Curated by ChEMBL
LigandPNGBDBM50400915(CHEMBL2205057)
Affinity DataKi:  251nM. Assay description: Displacement of [125I]-CXCL10 from human CXCR3 expressed in HEK293 cells
In DepthDetails ArticlePubMed