BDBM50400921 CHEMBL2205065
SMILES Cc1cccc(c1)-c1ccc(C[N+](C)(C)CC2=CC[C@H]3C[C@@H]2C3(C)C)cc1
InChI Key InChIKey=ZYVSCMYTJFDJLH-DQEYMECFSA-N
Data  1 KI
  Tab Delimited (TSV)   2D SDfile   Computed 3D by Vconf -m prep SDfile
Find this compound or compounds like it in BindingDB:
Activity Spreadsheet -- Enzyme Inhibition Constant Data from BindingDB
Found 1 hit for monomerid = 50400921
TargetC-X-C chemokine receptor type 3(Homo sapiens (Human))
Vu University Amsterdam
Curated by ChEMBL
LigandPNGBDBM50400921(CHEMBL2205065)
Affinity DataKi:  398nM. Assay description: Displacement of [125I]-CXCL10 from human CXCR3 expressed in HEK293 cells
In DepthDetails ArticlePubMed