BDBM50400942 CHEMBL2205686
SMILES CN(CC1=CC[C@H]2C[C@@H]1C2(C)C)Cc1ccc(cc1)-c1cccc(c1)C(C)=O
InChI Key InChIKey=OFZRQPFWQXICPT-DQEYMECFSA-N
Data  1 KI
  Tab Delimited (TSV)   2D SDfile   Computed 3D by Vconf -m prep SDfile
Find this compound or compounds like it in BindingDB:
Activity Spreadsheet -- Enzyme Inhibition Constant Data from BindingDB
Found 1 hit for monomerid = 50400942
TargetC-X-C chemokine receptor type 3(Homo sapiens (Human))
Vu University Amsterdam
Curated by ChEMBL
LigandPNGBDBM50400942(CHEMBL2205686)
Affinity DataKi: >316nM. Assay description: Displacement of [125I]-CXCL10 from human CXCR3 expressed in HEK293 cells
In DepthDetails ArticlePubMed