BDBM50401080 CHEMBL2203706
SMILES CN(C(=O)C(C)(C)c1cc(cc(c1)C(F)(F)F)C(F)(F)F)c1cnc(cc1-c1ccc(F)cc1C)N1CC[C@H](O)C1
InChI Key InChIKey=HCGIROBRNBTDFG-NRFANRHFSA-N
Data  2 KI  1 Kd
  Tab Delimited (TSV)   2D SDfile   Computed 3D by Vconf -m prep SDfile
Find this compound or compounds like it in BindingDB:
Activity Spreadsheet -- Enzyme Inhibition Constant Data from BindingDB
Found 3 hits for monomerid = 50401080
TargetSubstance-P receptor(Homo sapiens (Human))
F. Hoffmann-La Roche
Curated by ChEMBL
LigandPNGBDBM50401080(CHEMBL2203706)
Affinity DataKi:  1.30nM. Assay description: Displacement of radioligand [3H]SP from wild type human NK1 receptor expressed in HEK293 cells
In DepthDetails ArticlePubMed
TargetNeuromedin-K receptor(Homo sapiens (Human))
F. Hoffmann-La Roche
Curated by ChEMBL
LigandPNGBDBM50401080(CHEMBL2203706)
Affinity DataKi:  11.9nM. Assay description: Displacement of [3H]osanetant from wild type human NK3 receptor expressed in HEK293 cells
In DepthDetails ArticlePubMed
TargetNeuromedin-K receptor(Homo sapiens (Human))
F. Hoffmann-La Roche
Curated by ChEMBL
LigandPNGBDBM50401080(CHEMBL2203706)
Affinity DataKd:  120nM. Assay description: Competitive inhibition at wild type human NK3 expressed in HEK293 cells assessed as decrease in [MePhe7]NKB-induced [3H]IP accumulation after 20 mins
In DepthDetails ArticlePubMed