BDBM50401081 CHEMBL2203705
SMILES CN(C(=O)C(C)(C)c1cc(cc(c1)C(F)(F)F)C(F)(F)F)c1cnc(cc1-c1ccc(F)cc1C)N1CCC[C@H]1CO
InChI Key InChIKey=YUERFHADRHAZBK-QFIPXVFZSA-N
Data  2 KI
  Tab Delimited (TSV)   2D SDfile   Computed 3D by Vconf -m prep SDfile
Find this compound or compounds like it in BindingDB:
Activity Spreadsheet -- Enzyme Inhibition Constant Data from BindingDB
Found 2 hits for monomerid = 50401081
TargetSubstance-P receptor(Homo sapiens (Human))
F. Hoffmann-La Roche
Curated by ChEMBL
LigandPNGBDBM50401081(CHEMBL2203705)
Affinity DataKi:  1.40nM. Assay description: Displacement of radioligand [3H]SP from wild type human NK1 receptor expressed in HEK293 cells
In DepthDetails ArticlePubMed
TargetNeuromedin-K receptor(Homo sapiens (Human))
F. Hoffmann-La Roche
Curated by ChEMBL
LigandPNGBDBM50401081(CHEMBL2203705)
Affinity DataKi:  1.5nM. Assay description: Displacement of [3H]osanetant from wild type human NK3 receptor expressed in HEK293 cells
In DepthDetails ArticlePubMed