BDBM50401732 CHEMBL2206507
SMILES CN1CC(c2cccc(Cl)c2)c2ccc(C)cc2C1
InChI Key InChIKey=ZXQHLFVRUPRIEJ-UHFFFAOYSA-N
Data  3 KI
  Tab Delimited (TSV)   2D SDfile   Computed 3D by Vconf -m prep SDfile
Find this compound or compounds like it in BindingDB:
Activity Spreadsheet -- Enzyme Inhibition Constant Data from BindingDB
Found 3 hits for monomerid = 50401732
TargetSodium-dependent noradrenaline transporter(Homo sapiens (Human))
Amri
Curated by ChEMBL
LigandPNGBDBM50401732(CHEMBL2206507)
Affinity DataKi:  5nM. Assay description: Inhibition of human NET
In DepthDetails ArticlePubMed
TargetSodium-dependent dopamine transporter(Homo sapiens (Human))
Amri
Curated by ChEMBL
LigandPNGBDBM50401732(CHEMBL2206507)
Affinity DataKi:  36nM. Assay description: Inhibition of DAT
In DepthDetails ArticlePubMed
TargetSodium-dependent serotonin transporter(Homo sapiens (Human))
Amri
Curated by ChEMBL
LigandPNGBDBM50401732(CHEMBL2206507)
Affinity DataKi:  338nM. Assay description: Inhibition of SERT
In DepthDetails ArticlePubMed