BDBM50402476 CHEMBL2204037
SMILES COCCn1c(=O)[nH]c([C@@H]2CC[C@@H](CC2)c2ccccc2)c(Cc2cccc(c2)C(F)(F)F)c1=O
InChI Key InChIKey=UQBGCOBIBWRETH-OYRHEFFESA-N
Data  1 KI
  Tab Delimited (TSV)   2D SDfile   Computed 3D by Vconf -m prep SDfile
Find this compound or compounds like it in BindingDB:
Activity Spreadsheet -- Enzyme Inhibition Constant Data from BindingDB
Found 1 hit for monomerid = 50402476
TargetGlucocorticoid receptor(Homo sapiens (Human))
Corcept Therapeutics
Curated by ChEMBL
LigandPNGBDBM50402476(CHEMBL2204037)
Affinity DataKi: >50nM. Assay description: Displacement of [3H]dexamethasone from human recombinant glucocorticoid receptor expressed in baculovirus after 18 hrs by scintillation counting anal...
In DepthDetails ArticlePubMed