BDBM50402481 CHEMBL2204060
SMILES Cn1c(=O)[nH]c([C@@H]2CC[C@@H](CC2)c2ccccc2)c(Cc2ccccc2)c1=O
InChI Key InChIKey=RZWVLFBRJYIAKV-BGYRXZFFSA-N
Data  2 KI
  Tab Delimited (TSV)   2D SDfile   Computed 3D by Vconf -m prep SDfile
Find this compound or compounds like it in BindingDB:
Activity Spreadsheet -- Enzyme Inhibition Constant Data from BindingDB
Found 2 hits for monomerid = 50402481
TargetGlucocorticoid receptor(Homo sapiens (Human))
Corcept Therapeutics
Curated by ChEMBL
LigandPNGBDBM50402481(CHEMBL2204060)
Affinity DataKi:  24nM. Assay description: Displacement of [3H]dexamethasone from human recombinant glucocorticoid receptor expressed in baculovirus after 18 hrs by scintillation counting anal...
In DepthDetails ArticlePubMed
TargetGlucocorticoid receptor(Homo sapiens (Human))
Corcept Therapeutics
Curated by ChEMBL
LigandPNGBDBM50402481(CHEMBL2204060)
Affinity DataKi:  57nM. Assay description: Antagonist activity at glucocorticoid receptor in human SW1353 cells assessed as inhibition of dexamethasone-induced luciferase expression after 16 h...
In DepthDetails ArticlePubMed