BDBM50402483 CHEMBL2204058
SMILES FC(F)(F)c1cccc(Cc2c([nH]c(=O)[nH]c2=O)[C@@H]2CC[C@@H](CC2)c2ccccc2)n1
InChI Key InChIKey=PRHJSEQMUSWYNO-IYBDPMFKSA-N
Data  2 KI
  Tab Delimited (TSV)   2D SDfile   Computed 3D by Vconf -m prep SDfile
Find this compound or compounds like it in BindingDB:
Activity Spreadsheet -- Enzyme Inhibition Constant Data from BindingDB
Found 2 hits for monomerid = 50402483
TargetGlucocorticoid receptor(Homo sapiens (Human))
Corcept Therapeutics
Curated by ChEMBL
LigandPNGBDBM50402483(CHEMBL2204058)
Affinity DataKi:  18nM. Assay description: Displacement of [3H]dexamethasone from human recombinant glucocorticoid receptor expressed in baculovirus after 18 hrs by scintillation counting anal...
In DepthDetails ArticlePubMed
TargetGlucocorticoid receptor(Homo sapiens (Human))
Corcept Therapeutics
Curated by ChEMBL
LigandPNGBDBM50402483(CHEMBL2204058)
Affinity DataKi:  47nM. Assay description: Antagonist activity at glucocorticoid receptor in human SW1353 cells assessed as inhibition of dexamethasone-induced luciferase expression after 16 h...
In DepthDetails ArticlePubMed