BDBM50403105 CHEMBL2216917
SMILES CCOC(=O)C(=O)N(Cc1ccccc1)c1ccc2OC(COc3ccc(cc3)C(N)=N)COc2c1
InChI Key InChIKey=TVKPLGVIMIGLSZ-UHFFFAOYSA-N
Data  1 KI
  Tab Delimited (TSV)   2D SDfile   Computed 3D by Vconf -m prep SDfile
Find this compound or compounds like it in BindingDB:
Activity Spreadsheet -- Enzyme Inhibition Constant Data from BindingDB
Found 1 hit for monomerid = 50403105
TargetProthrombin(Homo sapiens (Human))
University Of Ljubljana
Curated by ChEMBL
LigandPNGBDBM50403105(CHEMBL2216917)
Affinity DataKi:  178nM. Assay description: Inhibition of thrombin
In DepthDetails ArticlePubMed