BDBM50406071 CHEMBL63619
SMILES COc1ccc(Cn2cc[nH]c2=S)cc1C
InChI Key InChIKey=AHOIPLXXTUVWKJ-UHFFFAOYSA-N
Data  3 IC50
  Tab Delimited (TSV)   2D SDfile   Computed 3D by Vconf -m prep SDfile
Find this compound or compounds like it in BindingDB:
Activity Spreadsheet -- Enzyme Inhibition Constant Data from BindingDB
Found 3 hits for monomerid = 50406071
TargetDopamine beta-hydroxylase(Rattus norvegicus)
University Of Illinois
Curated by ChEMBL
LigandPNGBDBM50406071(CHEMBL63619)
Affinity DataIC50:  6.92E+4nM. Assay description: Inhibition of dopamine beta-hydroxylase (DbetaH) in hypertensive rats when administered orally (or) intraperitoneally
In DepthDetails ArticlePubMed
TargetDopamine beta-hydroxylase(Homo sapiens (Human))
Molecular Simulations
Curated by ChEMBL
LigandPNGBDBM50406071(CHEMBL63619)
Affinity DataIC50:  6.92E+4nM. Assay description: Inhibition of dopamine beta hydroxylase
In DepthDetails ArticlePubMed
TargetDopamine beta-hydroxylase(Homo sapiens (Human))
Molecular Simulations
Curated by ChEMBL
LigandPNGBDBM50406071(CHEMBL63619)
Affinity DataIC50:  6.92E+4nM. Assay description: Inhibition of dopamine beta-hydroxylase (DbetaH) enzyme
In DepthDetails ArticlePubMed