BDBM50412998 CHEMBL476619
SMILES Cc1c(Cn2ncc(N3CCNCC3)c(Cl)c2=O)cccc1NC(=O)c1cccc(c1)-c1ccsc1
InChI Key InChIKey=IIJOEYPWABJIOZ-UHFFFAOYSA-N
Data  1 EC50
  Tab Delimited (TSV)   2D SDfile   Computed 3D by Vconf -m prep SDfile
Find this compound or compounds like it in BindingDB:
Activity Spreadsheet -- Enzyme Inhibition Constant Data from BindingDB
Found 1 hit for monomerid = 50412998
TargetMas-related G-protein coupled receptor member X1(Homo sapiens (Human))
Glaxosmithkline
Curated by ChEMBL
LigandPNGBDBM50412998(CHEMBL476619)
Affinity DataEC50:  4.17E+3nM. Assay description: Agonist activity at human MrgX1 receptor expressed in HEK293 cells assessed as intracellular calcium mobilization by FLIPR assay
In DepthDetails ArticlePubMed