BDBM50413540 CHEMBL471662
SMILES CCCN1CCC(COc2nc3ccsc3n3cccc23)CC1
InChI Key InChIKey=ZJPKMWZNBQJVDC-UHFFFAOYSA-N
Data  1 KI
  Tab Delimited (TSV)   2D SDfile   Computed 3D by Vconf -m prep SDfile
Find this compound or compounds like it in BindingDB:
Activity Spreadsheet -- Enzyme Inhibition Constant Data from BindingDB
Found 1 hit for monomerid = 50413540
Target5-hydroxytryptamine receptor 4(GUINEA PIG)
Université
Curated by ChEMBL
LigandPNGBDBM50413540(CHEMBL471662)
Affinity DataKi:  16.2nM. Assay description: Displacement of [3H]GR-113808 from 5HT4 receptor in guinea pig striatum membrane
In DepthDetails ArticlePubMed