BDBM50415996 CHEMBL1085037
SMILES OCCNC[C@@H]1CCCc2cc(ccc12)S(=O)(=O)c1cccc(F)c1
InChI Key InChIKey=OSRIONOQBURAGV-HNNXBMFYSA-N
Data  1 KI
  Tab Delimited (TSV)   2D SDfile   Computed 3D by Vconf -m prep SDfile
Find this compound or compounds like it in BindingDB:
Activity Spreadsheet -- Enzyme Inhibition Constant Data from BindingDB
Found 1 hit for monomerid = 50415996
Target5-hydroxytryptamine receptor 6(Homo sapiens (Human))
Roche Palo Alto
Curated by ChEMBL
LigandPNGBDBM50415996(CHEMBL1085037)
Affinity DataKi:  0.126nM. Assay description: Displacement of [3H]LSD form human recombinant 5HT6 receptor
In DepthDetails ArticlePubMed