BDBM50416696 CHEMBL1223281
SMILES COc1cccc(SC[C@H](C)NC(C)=O)c1
InChI Key InChIKey=BTZZPTZDAHOEMB-VIFPVBQESA-N
Data  4 KI
  Tab Delimited (TSV)   2D SDfile   Computed 3D by Vconf -m prep SDfile
Find this compound or compounds like it in BindingDB:
Activity Spreadsheet -- Enzyme Inhibition Constant Data from BindingDB
Found 4 hits for monomerid = 50416696
TargetMelatonin receptor type 1B(Homo sapiens (Human))
Universit£
Curated by ChEMBL
LigandPNGBDBM50416696(CHEMBL1223281)
Affinity DataKi:  263nM. Assay description: Displacement of [125I]iodomelatonin from human cloned MT2 receptor expressed in rat NIH3T3 cells after 90 mins
In DepthDetails ArticlePubMed
TargetMelatonin receptor type 1A(Homo sapiens (Human))
Universit£
Curated by ChEMBL
LigandPNGBDBM50416696(CHEMBL1223281)
Affinity DataKi:  479nM. Assay description: Displacement of [125I]iodomelatonin from human cloned MT1 receptor expressed in rat NIH3T3 cells after 90 mins
In DepthDetails ArticlePubMed
TargetMelatonin receptor type 1B(Homo sapiens (Human))
Universit£
Curated by ChEMBL
LigandPNGBDBM50416696(CHEMBL1223281)
Affinity DataKi:  1.32E+3nM. Assay description: Displacement of [125I]iodomelatonin from human cloned MT2 receptor expressed in rat NIH3T3 cells after 90 mins
In DepthDetails ArticlePubMed
TargetMelatonin receptor type 1A(Homo sapiens (Human))
Universit£
Curated by ChEMBL
LigandPNGBDBM50416696(CHEMBL1223281)
Affinity DataKi:  1.20E+4nM. Assay description: Displacement of [125I]iodomelatonin from human cloned MT1 receptor expressed in rat NIH3T3 cells after 90 mins
In DepthDetails ArticlePubMed