BDBM50417050 CHEMBL1258674
SMILES Fc1cc(F)cc(c1)-c1ccc(NC[C@H]2CC[C@@]3(CN(C(=O)O3)c3cccnn3)CC2)nn1
InChI Key InChIKey=MVPOCFZDEVKWFO-CWSKOGRWSA-N
Data  1 KI
  Tab Delimited (TSV)   2D SDfile   Computed 3D by Vconf -m prep SDfile
Find this compound or compounds like it in BindingDB:
Activity Spreadsheet -- Enzyme Inhibition Constant Data from BindingDB
Found 1 hit for monomerid = 50417050
TargetNeuropeptide Y receptor type 5(Homo sapiens (Human))
Glaxosmithkline
Curated by ChEMBL
LigandPNGBDBM50417050(CHEMBL1258674)
Affinity DataKi:  0.100nM. Assay description: Antagonist activity at human NPY Y5 receptor
In DepthDetails ArticlePubMed