BDBM504173 N-(6-(4-((4-Chloro-1H- imidazol-5-yl)methyl)piperazin- 1-yl)-2,2-dimethyl-2,3- dihydrobenzofuran-5- yl)pyrazolo[1,5-a)pyrimidine-3 carboxamide::US11034698, Example 10
SMILES CC1(C)Cc2cc(NC(=O)c3cnn4cccnc34)c(cc2O1)N1CCN(Cc2[nH]cnc2Cl)CC1
InChI Key InChIKey=NGFCFKOOAOGSRZ-UHFFFAOYSA-N
Data  1 KI
  Tab Delimited (TSV)   2D SDfile   Computed 3D by Vconf -m prep SDfile
Find this compound or compounds like it in BindingDB:
Activity Spreadsheet -- Enzyme Inhibition Constant Data from BindingDB
Found 1 hit for monomerid = 504173
TargetNuclear receptor ROR-gamma(Homo sapiens (Human))
Genentech
US Patent
LigandPNGBDBM504173(N-(6-(4-((4-Chloro-1H- imidazol-5-yl)methyl)pipera...)
Affinity DataKi:  2.30nM. Assay description: The IRAK4 reaction conditions were optimized using an IRAK1-derived peptide (sequence H-KKARFSRFAGSSPSQSSMVAR) to provide a linear reaction rate over...
Ligand InfoPC cidPC sid
In DepthDetails US Patent