BDBM50417944 BICIFADINE
SMILES Cc1ccc(cc1)C12CC1CNC2
InChI Key InChIKey=OFYVIGTWSQPCLF-UHFFFAOYSA-N
Data  4 IC50
  Tab Delimited (TSV)   2D SDfile   Computed 3D by Vconf -m prep SDfile
Find this compound or compounds like it in BindingDB:
Activity Spreadsheet -- Enzyme Inhibition Constant Data from BindingDB
Found 3 hits for monomerid = 50417944
TargetSodium-dependent noradrenaline transporter(Homo sapiens (Human))
Biocon Bristol-Myers Squibb R&D Centre
Curated by ChEMBL
LigandPNGBDBM50417944(BICIFADINE)
Affinity DataIC50:  55nM. Assay description: Binding affinity to NET (unknown origin)
In DepthDetails ArticlePubMed
TargetSodium-dependent dopamine transporter(Homo sapiens (Human))
Biocon Bristol-Myers Squibb R&D Centre
Curated by ChEMBL
LigandPNGBDBM50417944(BICIFADINE)
Affinity DataIC50:  910nM. Assay description: Binding affinity to DAT (unknown origin)
In DepthDetails ArticlePubMed
TargetSodium-dependent serotonin transporter(Homo sapiens (Human))
Biocon Bristol-Myers Squibb R&D Centre
Curated by ChEMBL
LigandPNGBDBM50417944(BICIFADINE)
Affinity DataIC50:  117nM. Assay description: Binding affinity to SERT (unknown origin)
In DepthDetails ArticlePubMed