BDBM50419416 CHEMBL1915264
SMILES Cc1cc(nn1Cc1cc(Cl)cc2cc(oc12)-c1ccccc1)C(=O)NN1CCOCC1
InChI Key InChIKey=BATVBXSSNSBMMX-UHFFFAOYSA-N
Data  1 IC50
  Tab Delimited (TSV)   2D SDfile   Computed 3D by Vconf -m prep SDfile
Find this compound or compounds like it in BindingDB:
Activity Spreadsheet -- Enzyme Inhibition Constant Data from BindingDB
Found 1 hit for monomerid = 50419416
TargetProstaglandin E2 receptor EP1 subtype(Homo sapiens (Human))
Glaxosmithkline
Curated by ChEMBL
LigandPNGBDBM50419416(CHEMBL1915264)
Affinity DataIC50:  10nM. Assay description: Displacement of [3H]GW875240X from human prostanoid EP1 receptor expressed in CHO-K1 cells after 45 mins by topcount liquid scintillation counting
In DepthDetails ArticlePubMed